{"text_format":"1","workbook":"xlsx","n_sheets":7,"sheets":["Start","Bard","Druid","Healer","WCalc","Calc","Wizard"],"not_rendered":{"charts":0,"images":0,"macros":1,"external_links":2,"defined_names":1,"comments":1,"pivot_tables":0},"unopened":[],"bounds":{"document_bytes":16777216,"sheet_cells":100000,"rows_first":2000,"rows_last":500,"rows_between":2000,"halvings":0,"cell_chars":16384,"cell_head_chars":4096},"cells_cut":0,"cells_raw":0,"read":"whole","date_system":"1900"}

{"sheet":"Start","index":0,"n_rows":12,"n_cols":2,"rows_kept":12,"cut":false,"hidden":false,"merged":[]}
["At this time, I have only completed the Healer spell list. At a later time, if enough feedback and or interest is shown, I may complete this for the other magic casting classes."]
["As such, I am still looking for testing and feedback. Feel free to send such to hannoske@yahoo.com."]
["Please include a method of contact, and as much detail as you can about the issue, or input that you have."]
["You must enable macros to utilize this program. If you are unfamiliar with how to do so, please use the interwebs and find out."]
[]
[]
[]
[]
[]
[]
[]
[null,"For the time being, press the button below to start. "]

{"sheet":"Bard","index":1,"n_rows":0,"n_cols":0,"rows_kept":0,"cut":false,"hidden":true,"merged":[]}

{"sheet":"Druid","index":2,"n_rows":0,"n_cols":0,"rows_kept":0,"cut":false,"hidden":true,"merged":[]}

{"sheet":"Healer","index":3,"n_rows":51,"n_cols":10,"rows_kept":51,"cut":false,"hidden":false,"merged":[[1,4,1,5],[0,3,0,4],[0,0,0,2]]}
["(NAME)",null,null,"Healer"]
["Weapons","Cost","Number",1,{"$f":"IF(D2=1, \"st Level\",IF(D2=2, \"nd Level\", IF(D2=3, \"rd Level\", \"th Level\")))","v":"st Level"},null,null,null,0]
["Dagger",0,0,0,null,null,"Spells"]
["Short",3,0,0,null,null,"Level","Used",null,"Total"]
["Long",5,0,0,null,null,1,{"$f":" 0 + 0 + 0 + 0 + 0 + 0 + 0","v":0},10,10]
["Spear","-",0,0,null,null,2,{"$f":" 0 + 0 + 0 + 0 + 0 + 0","v":0},0,0]
["Staff",3,0,0,null,null,3,{"$f":" 0 + 0 + 0 + 0 + 0 + 0 + 0","v":0},0,0]
["Hinged",3,0,0,null,null,4,{"$f":" 0 + 0 + 0 + 0 + 0","v":0},0,0]
["Shield",3,0,0,null,null,5,{"$f":" 0 + 0 + 0 + 0 + 0","v":0},0,0]
["Bow","-",0,0,null,null,6,{"$f":" 0 + 0 + 0 + 0","v":0},0,0]
["Magic","Type","School","Uses","Cost","Max","Range","Bought","Prev","Points"]
["First Level",null,null,null,null,null,null,null,null,{"$f":"SUM(J13:J19)","v":0}]
["Cancel","S","Sorcery","Unlimited",0,"-",50,0,0,{"$f":"H13*E13","v":0}]
["Cure Ailments","S","Spirit","1/life",1,4,"T",0,0,{"$f":"H14*E14","v":0}]
["Heal","S","Spirit","Unlimited",0,"-","T",0,0,0]
["Lost","S","Subdual","1/life",1,4,20,0,0,0]
["Mend","S","Sorcery","1/life",1,8,"T",0,0,0]
["Mute","S","Control","1/life",2,4,20,0,0,0]
["Talk to Dead","S","Spirit","1/game",1,"-","T",0,0,0]
["Second Level",null,null,null,null,null,null,0,0,{"$f":"SUM(J21:J26)","v":0}]
["Banish","S","Sorcery","1/life",1,4,20,0,0,{"$f":"H21*E21","v":0}]
["Bless","E","Protection","1/life",2,4,"T",0,0,0]
["Entangle","B","Subdual","1 bolt/U",1,2,"--",0,0,0]
["Heal Extend","S","Spirit","1/life",1,"-",20,0,0,0]
["Sleep","S","Subdual","1/life",2,4,20,0,0,0]
["Swords to Plowshares","S","Spirit","1/life",1,2,20,0,0,0]
["Third Level",null,null,null,null,null,null,0,0,{"$f":"SUM(J28:J34)","v":0}]
["Mass Sleep","S","Subdual","1/game",1,1,"LOS",0,0,{"$f":"H28*E28","v":0}]
["Protect","E","Protection","1/game",1,4,"T",0,0,{"$f":"H29*E29","v":0}]
["Protection from Ailments","E","Protection","1/game",1,4,"T",0,0,0]
["Resurrect","S","Spirit","1/game",1,8,"T",0,0,0]
["Stun","S","Sorcery","1/life",2,2,20,0,0,0]
["Wounding","S","Death","1/life",1,2,20,0,0,0]
["Yield","S","Control","1/game",2,4,50,0,0,0]
["Fourth Level",null,null,null,null,null,null,0,0,{"$f":"SUM(J36:J40)","v":0}]
["Enhancement","N","Neutral","1/game",1,1,"--",0,0,{"$f":"H36*E36","v":0}]
["Harden","E","Protection","1/game",1,4,"T",0,0,{"$f":"H37*E37","v":0}]
["Release","S","Sorcery","1/life",1,4,20,0,0,{"$f":"H38*E38","v":0}]
["Sever Spirit","S","Spirit","1/life",2,4,"T",0,0,{"$f":"H39*E39","v":0}]
["Touch of Death","E","Sorcery/Death","1/game",1,4,"T",0,0,{"$f":"H40*E40","v":0}]
["Fifth Level",null,null,null,null,null,null,0,0,{"$f":"SUM(J42:J46)","v":0}]
["Awe/Fear","S","Control","1/game",1,4,20,0,0,{"$f":"H42*E42","v":0}]
["Extension","N","Neutral","1/life",1,2,"--",0,0,{"$f":"H43*E43","v":0}]
["Protection from Death","E","Protection","1/game",1,4,"T",0,0,{"$f":"H44*E44","v":0}]
["Protection form Magic","E","Protection","1/game",1,4,"T",0,0,{"$f":"H45*E45","v":0}]
["Summon Dead","S","Spirit","1/life",1,"-",50,0,0,{"$f":"H46*E46","v":0}]
["Sixth Level",null,null,null,null,null,null,0,0,{"$f":"SUM(J48:J51)","v":0}]
["Circle of Protection","FE","Sorcery","Unlimited",2,"-","T",0,0,{"$f":"H48*E48","v":0}]
["Dispel Magic","S","Sorcery","1/game",1,4,20,0,0,{"$f":"H49*E49","v":0}]
["Hallowed Ground","FE","Spirit","1/game",1,2,"T",0,0,{"$f":"H50*E50","v":0}]
["Teleport","S","Sorcery","1/game",1,4,"T",0,0,{"$f":"H51*E51","v":0}]

{"sheet":"WCalc","index":4,"n_rows":50,"n_cols":8,"rows_kept":50,"cut":false,"hidden":true,"merged":[]}
["Weapons"]
["Cost","Level","1st","2nd","3rd","4th","5th","6th"]
[2,1,8,0,0,0,0,0]
[null,2,8,8,0,0,0,0]
[null,3,8,8,8,0,0,0]
[null,4,6,6,6,6,0,0]
[null,5,4,5,5,5,5,0]
[null,6,4,4,4,4,4,4]
[3,1,7,0,0,0,0,0]
[null,2,7,7,0,0,0,0]
[null,3,7,7,7,0,0,0]
[null,4,5,5,5,6,0,0]
[null,5,4,4,4,4,5,0]
[null,6,3,4,3,4,3,4]
[4,1,6,0,0,0,0,0]
[null,2,6,6,0,0,0,0]
[null,3,6,6,6,0,0,0]
[null,4,4,5,4,5,0,0]
[null,5,4,3,4,3,4,0]
[null,6,3,3,3,3,3,3]
[5,1,5,0,0,0,0,0]
[null,2,5,5,0,0,0,0]
[null,3,5,5,5,0,0,0]
[null,4,3,4,4,4,0,0]
[null,5,3,3,3,3,3,0]
[null,6,2,3,2,3,2,3]
[6,1,4,0,0,0,0,0]
[null,2,4,4,0,0,0,0]
[null,3,4,4,4,0,0,0]
[null,4,3,3,3,3,0,0]
[null,5,2,2,3,2,3,0]
[null,6,2,2,2,2,2,2]
[7,1,3,0,0,0,0,0]
[null,2,3,3,0,0,0,0]
[null,3,3,3,3,0,0,0]
[null,4,2,2,2,3,0,0]
[null,5,1,2,2,2,2,0]
[null,6,1,2,1,2,1,2]
[8,1,2,0,0,0,0,0]
[null,2,2,2,0,0,0,0]
[null,3,2,2,2,0,0,0]
[null,4,1,2,1,2,0,0]
[null,5,1,1,1,1,2,0]
[null,6,1,1,1,1,1,1]
[9,1,1,0,0,0,0,0]
[null,2,1,1,0,0,0,0]
[null,3,1,1,1,0,0,0]
[null,4,0,1,1,1,0,0]
[null,5,1,0,1,0,1,0]
[null,6,0,1,0,1,0,1]

{"sheet":"Calc","index":5,"n_rows":75,"n_cols":20,"rows_kept":75,"cut":false,"hidden":true,"merged":[[5,2,5,3],[5,4,5,6],[13,2,13,7]]}
["Healer","Actual","Effectiv","MP",null,null,null,"1st load?",false,"Error #",0]
["Level:",1,{"$f":"IF(B2>2,3,B2)","v":1},{"$f":"C2*10","v":10},null,null,null,"Name:","(NAME)"]
[null,"cost/lvl","total cost","mp remain/lvl","mp remain"]
["Weapons:",{"$f":"D37","v":0},{"$f":"B4*C2","v":0},{"$f":"((E4)/B2)","v":10},{"$f":"D2-C4","v":10}]
[null,null,null,null,null,null,null,null,null,null,null,"MP by level totals",null,1,2,3,4,5,6]
["MP","Totals","After weapons",null,"readjust",null,null,null,null,null,null,1,{"$f":"N13","v":10},{"$f":"IF(A7=1,B7,0)","v":10},{"$f":"IF($A7=2,$B7,0)","v":0},{"$f":"IF($A7=3,$B7,0)","v":0},{"$f":"IF($A7=4,$B7,0)","v":0},{"$f":"IF($A7=5,$B7,0)","v":0},{"$f":"IF(A7=6,B7,0)","v":0}]
[{"$f":"B2","v":1},{"$f":"G7","v":10},{"$f":"IF(A7<>\"-\",$D$4-0.5,0)","v":9.5},{"$f":"ROUND(C7,0)","v":10},{"$f":"IF(A17>0,D7+1,D7)","v":10},{"$f":"IF(G17>0,E7+1,E7)","v":10},{"$f":"IF(H17>0,F7+1,F7)","v":10},null,null,null,null,2,{"$f":"O13","v":0},0,{"$f":"IF(A8=2,B8,0)","v":0},{"$f":"IF($A8=3,$B8,0)","v":0},{"$f":"IF($A8=4,$B8,0)","v":0},{"$f":"IF($A8=5,$B8,0)","v":0}]
[{"$f":"IF(B2>1,B2-1,\"-\")","v":"-"},0,0,0,{"$f":"IF(D17>0,D8+1,D8)","v":0},{"$f":"E8","v":0},{"$f":"F8","v":0},null,null,null,null,3,{"$f":"P13","v":0},0,{"$f":"IF(A9=2,B9,0)","v":0},{"$f":"IF($A9=3,$B9,0)","v":0},{"$f":"IF($A9=4,$B9,0)","v":0}]
[{"$f":"IF(B2>2,B2-2,\"-\")","v":"-"},0,0,0,{"$f":"IF(B17>0,D9+1,D9)","v":0},{"$f":"E9","v":0},{"$f":"F9","v":0},null,null,null,null,4,{"$f":"Q13","v":0},0,{"$f":"IF(A10=2,B10,0)","v":0},{"$f":"IF($A10=3,$B10,0)","v":0}]
[{"$f":"IF(B2>3,B2-3,\"-\")","v":"-"},0,0,0,{"$f":"IF(E17>0,D10+1,D10)","v":0},{"$f":"E10","v":0},{"$f":"IF(E20=2,F10+1,F10)","v":0},null,null,null,null,5,{"$f":"R13","v":0},0,{"$f":"IF(A11=2,B11,0)","v":0}]
[{"$f":"IF(B2>4,B2-4,\"-\")","v":"-"},0,0,0,{"$f":"IF(C17>0,D11+1,D11)","v":0},{"$f":"E11","v":0},{"$f":"IF(E20=2,F11-1,F11)","v":0},null,null,null,null,6,{"$f":"S6","v":0},0]
[{"$f":"IF(B2=6, 1,\"-\")","v":"-"},0,0,0,{"$f":"IF(F17>0,D12+1,D12)","v":0},{"$f":"E12","v":0},{"$f":"F12","v":0},null,null,null,null,"Voice",{"$f":"B13","v":0},{"$f":"F30","v":0},{"$f":"F31","v":0},{"$f":"F32","v":0}]
["Voice",{"$f":"F33","v":0},{"$f":"SUM(C7:C12)","v":9.5},{"$f":"SUM(D7:D12)","v":10},{"$f":"SUM(E7:E12)","v":10},{"$f":"SUM(F7:F12)","v":10},{"$f":"SUM(G7:G12)","v":10},{"$f":"SUM(M6:M11)","v":10},null,null,null,null,null,{"$f":"SUM(N6:N12)","v":10},{"$f":"SUM(O6:O12)","v":0},{"$f":"SUM(P6:P12)","v":0},{"$f":"SUM(Q6:Q11)","v":0},{"$f":"SUM(R6:R11)","v":0},{"$f":"S6","v":0}]
[null,null,"Totals"]
["Readjust Calc",null,null,null,null,null,null,null,null,null,null,1,2,3,4,5,6]
[{"$f":"IF(D13<E4,E4-D13,0)","v":0},{"$f":"IF(A17>0,A17-1,A16)","v":0},0,0,0,0,0,null,null,null,"b",{"$f":"IF(B23 = 1,SUM([1]Bard!M13:'[1]Bard'!M18),0)","v":0},{"$f":"IF(B23 = 1,SUM([1]Bard!M22:'[1]Bard'!M26),0)","v":0},{"$f":"IF(B23 = 1,SUM([1]Bard!M30:'[1]Bard'!M33),0)","v":0},{"$f":"IF(B23 = 1,SUM([1]Bard!M37:'[1]Bard'!M41),0)","v":0},{"$f":"IF(B23 = 1,SUM([1]Bard!M45:'[1]Bard'!M48),0)","v":0},{"$f":"IF(B23 = 1,SUM([1]Bard!M52:'[1]Bard'!M54),0)","v":0}]
[{"$f":"IF($A7<>\"-\",A16,0)","v":0},{"$f":"IF($A9<>\"-\",B16,0)","v":0},{"$f":"IF($A11<>\"-\",C16,0)","v":0},{"$f":"IF($A8<>\"-\",D16,0)","v":0},{"$f":"IF($A10<>\"-\",E16,0)","v":0},{"$f":"IF($A12<>\"-\",F16,0)","v":0},{"$f":"IF($A7<>\"-\",G16,0)","v":0},null,null,null,"d",{"$f":"IF(B24=1,SUM([1]Druid!M15:'[1]Druid'!M21),0)","v":0},{"$f":"IF(B24=1,SUM([1]Druid!M25:'[1]Druid'!M30),0)","v":0},{"$f":"IF(B24=1,SUM([1]Druid!M34:'[1]Druid'!M40),0)","v":0},{"$f":"IF(B24=1,SUM([1]Druid!M44:'[1]Druid'!M49),0)","v":0},{"$f":"IF(B24=1,SUM([1]Druid!M53:'[1]Druid'!M57),0)","v":0},{"$f":"IF(B24=1,SUM([1]Druid!M61:'[1]Druid'!M64),0)","v":0}]
[5,7,9,6,8,10,5,null,null,null,"h",{"$f":"IF(B25>0, 0, 0)","v":0},{"$f":"IF(B25>0, 0, 0)","v":0},{"$f":"IF(B25>0, 0, 0)","v":0},{"$f":"IF(B25>0, 0, 0)","v":0},{"$f":"IF(B25>0, 0, 0)","v":0},{"$f":"IF(B25>0, 0, 0)","v":0}]
[null,null,null,null,null,null,null,null,null,null,"w",{"$f":"IF(B26=1,SUM([1]Wizard!M13:'[1]Wizard'!M22),0)","v":0},{"$f":"IF(B26=1,SUM([1]Wizard!M26:'[1]Wizard'!M35),0)","v":0},{"$f":"IF(B26=1,SUM([1]Wizard!M39:'[1]Wizard'!M48),0)","v":0},{"$f":"IF(B26=1,SUM([1]Wizard!M52:'[1]Wizard'!M59),0)","v":0},{"$f":"IF(B26=1,SUM([1]Wizard!M63:'[1]Wizard'!M68),0)","v":0},{"$f":"IF(B26=1,SUM([1]Wizard!M72:'[1]Wizard'!M77),0)","v":0},"total spent","total remain"]
[null,{"$f":"IF(B2=5,1,0)","v":0},{"$f":"IF(B4=2,1,0)","v":0},{"$f":"IF(B4=7,1,0)","v":0},{"$f":"SUM(B20:D20)","v":0},null,null,null,null,null,"total",{"$f":"SUM(L16:L19)","v":0},0,0,0,0,0,{"$f":"SUM(L20:Q20)","v":0},{"$f":"H13-R20","v":10}]
["Class Weapon costs",null,null,null,null,null,null,null,null,null,"level remain",{"$f":"M6-L20","v":10},{"$f":"M7-M20+L22","v":0},{"$f":"M8-N20+M22","v":0},{"$f":"M9-O20+N22","v":0},{"$f":"M10-P20+O22","v":0},{"$f":"M11-Q20+P22","v":0}]
[null,"played?","short","long","spear","staff","hinged","shield","bow",null,"level too many?",{"$f":"IF(L21<0,L21,0)","v":0},0,0,0,0,0]
["Bard",{"$f":"IF(A1=\"Bard\",1,0)","v":0},{"$f":"IF($B23=1,3,0)","v":0},{"$f":"IF($B23=1,4,0)","v":0},0,{"$f":"IF($B23=1,2,0)","v":0},0,{"$f":"IF($B23=1,3,0)","v":0},0,null,"level spent over",{"$f":"L22*(-1)","v":0},0,0,0,0,0]
["Druid",{"$f":"IF(A1=\"Druid\",1,0)","v":0},{"$f":"IF($B24=1,2,0)","v":0},{"$f":"IF($B24=1,4,0)","v":0},{"$f":"IF($B24=1,4,0)","v":0},{"$f":"IF($B24=1,2,0)","v":0},0,{"$f":"IF($B24=1,4,0)","v":0},{"$f":"IF($B24=1,5,0)","v":0},null,"max remain/lvl",{"$f":"L27-SUM(L20:$Q20)+J30","v":10},{"$f":"IF(L25<0,L25,M27+L22-SUM(M20:$Q20)+J31)","v":0},{"$f":"IF(M25<0,M25,N27+M22-SUM(N20:$Q20)+J32)","v":0},{"$f":"IF(N25<0,N25,O27+N22-SUM(O20:$Q20))","v":0},{"$f":"IF(O25<0,O25,P27+O22-SUM(P20:$Q20))","v":0},{"$f":"IF(P25<0,P25,Q27+P22-SUM(Q20:$Q20))","v":0}]
["Healer",{"$f":"IF(A1=\"Healer\",1,0)","v":1},{"$f":"IF($B25=1,3,0)","v":3},{"$f":"IF($B25=1,5,0)","v":5},0,{"$f":"IF($B25=1,3,0)","v":3},{"$f":"IF($B25=1,3,0)","v":3},{"$f":"IF($B25=1,3,0)","v":3},0,null,"max lvl too many?",{"$f":"IF(L24<0,L24,0)","v":0},0,0,0,0,0]
["Wizard",{"$f":"IF(A1=\"Wizard\",1,0)","v":0},{"$f":"IF($B26=1,2,0)","v":0},{"$f":"IF($B26=1,4,0)","v":0},{"$f":"IF($B26=1,3,0)","v":0},{"$f":"IF($B26=1,2,0)","v":0},0,0,0,null,"max lvl spent over",{"$f":"L25-L25-L25","v":0},0,0,0,0,0]
["play check",{"$f":"SUM(B23:B26)","v":1},{"$f":"IF(SUM(C23:C26)>0,SUM(C23:C26),\"-\")","v":3},5,"-",3,3,3,"-","final","max pnts/lvl",{"$f":"SUM(N13:$S13)-J30","v":10},{"$f":"SUM(O13:$S13)-J31","v":0},{"$f":"SUM(P13:$S13)-J32","v":0},{"$f":"SUM(Q13:$S13)","v":0},{"$f":"SUM(R13:$S13)","v":0},{"$f":"SUM(S13:$S13)","v":0}]
[]
["imbue/expertise check",null,null,null,null,"enhnc adj","enhnc spell",null,"enhance pnt mod",null,null,"Druid/Voice Stats",null,null,null,null,null,"total avail","total remain"]
[null,{"$f":"IF(B26>0,[1]Wizard!B63,0)","v":0},"3 1st","advancement",null,{"$f":"IF(G30>0,G30*3,0)","v":0},{"$f":"IF(B26>0,B30,0)","v":0},null,"lvl1",{"$f":"J31+B30","v":0},"pnts spent",{"$f":"IF($B$33>0,SUM([1]Druid!M15:'[1]Druid'!M21),L20)","v":0},{"$f":"IF($B$33>0,SUM([1]Druid!M25:'[1]Druid'!M30),M20)","v":0},{"$f":"IF($B$33>0,SUM([1]Druid!M34:'[1]Druid'!M40),N20)","v":0},{"$f":"IF($B$33>0,SUM([1]Druid!M44:'[1]Druid'!M49),O20)","v":0},{"$f":"IF($B$33>0,SUM([1]Druid!M53:'[1]Druid'!M57),P20)","v":0},{"$f":"IF($B$33>0,\"*see comment\",Q20)","v":0},{"$f":"IF(B33>0,B13,H13)","v":10},{"$f":"IF(B33>0,Q31,S20)","v":10}]
[{"$f":"IF(B26>0,[1]Wizard!B73,0)","v":0},{"$f":"IF(B23>0,[1]Bard!B31,0)","v":0},"4/2 2nd","expertise/imbue",null,{"$f":"IF(G31>0,G31*H31,0)","v":0},{"$f":"A31+B31","v":0},{"$f":"IF(B23=1,2,4)","v":4},"lvl2",{"$f":"A31*2+B31+B32","v":0},"level remain",{"$f":"IF($B$33>0,0-L30,L21)","v":10},{"$f":"IF($B$33>0,0-M30+L31,M21)","v":0},{"$f":"IF($B$33>0,0-N30+M31,N21)","v":0},{"$f":"IF($B$33>0,0-O30+N31,O21)","v":0},{"$f":"IF($B$33>0,0-P30+O31,P21)","v":0},{"$f":"IF($B$33>0,B13-Q30+P31,Q21)","v":0}]
[null,{"$f":"IF(B25>0, 0,0)","v":0},"3 3rd","enhancement",null,{"$f":"IF(G32>0,G32*3,0)","v":0},{"$f":"IF(B25>0,B32,0)","v":0},null,"lvl3",{"$f":"B32","v":0},"lvl 2 many?",{"$f":"IF(L31<0,L31,0)","v":0},0,0,0,0,0]
[null,{"$f":"IF(B23>0,[1]Bard!B54,0)","v":0},"5 druid","voice",null,{"$f":"IF(G33>0,G33*5,0)","v":0},{"$f":"IF(B23>0,B33,0)","v":0},null,null,null,"lvl spnt ovr",{"$f":"L32-L32-L32","v":0},0,0,0,0,0]
[null,null,null,null,null,"Voice Adj",null,null,null,null,"mx remain/lvl",{"$f":"IF($B$33>0,$Q$31,L24)","v":10},0,0,0,0,0]
[null,null,null,null,null,null,null,null,null,null,"mx lvl 2 many?",{"$f":"IF(L34<0,L34,0)","v":0},0,0,0,0,0]
["Weapons and Companions Cost",null,null,null,null,"messages",null,null,null,null,"mx lvl spnt ovr",{"$f":"L35-L35-L35","v":0},0,0,0,0,0]
["Total",null,0,{"$f":"IF(C37<0,0,C37)","v":0},null,1,null,null,{"$f":"IF([1]Character!$B$3>1,\"From Next Highest Level:\",\"POINTS OVERSPENT:\")","v":"From Next Highest Level:"},null,"mx pnts/lvl",{"$f":"IF($B$33>0,$B$13,L27)","v":10},0,0,0,0,0]
[null,null,null,null,null,2,null,null,{"$f":"IF([1]Character!$B$3>2,\"From Next Highest Level:\",\"POINTS OVERSPENT:\")","v":"From Next Highest Level:"}]
["Warskill",{"$f":"IF(B23=1,IF(B2>3,IF([2]Bard!B41=1,1,0),0),0)","v":0},null,null,null,3,null,null,{"$f":"IF([1]Character!$B$3>3,\"From Next Highest Level:\",\"POINTS OVERSPENT:\")","v":"From Next Highest Level:"}]
[null,null,null,null,null,4,null,null,{"$f":"IF([1]Character!$B$3>4,\"From Next Highest Level:\",\"POINTS OVERSPENT:\")","v":"From Next Highest Level:"}]
[null,null,null,null,null,5,null,null,{"$f":"IF([1]Character!$B$3>5,\"From Next Highest Level:\",\"POINTS OVERSPENT:\")","v":"From Next Highest Level:"}]
[]
["Sumon Avail Check",null,"Bard","Druid","Healer","Wiz","Level","Yes if 2","Cost",null,null,null,null,null,null,"Purchased Monsters Text",null,null,{"$f":"IF(P44=1,\"Summoned Companion: \",IF(P44>1,\"Summoned Companions: \",\"\"))","v":{"$error":"#REF!"}}]
["Animal Familiar","(DOR13)",0,0,0,0,2,{"$f":"SUM(C44:G44)","v":2},1,"Any (1-3)",null,null,null,null,null,{"$f":"SUM([1]Character!K2:'[1]Character'!K$34)","v":{"$error":"#REF!"}},null,{"$f":"IF([1]Character!K2>0,IF(P44>[1]Character!K2,\"; \",\"\"),\"\")","v":""},{"$f":"IF([1]Character!K2=1,\"1 point \"&[1]Character!G2,IF([1]Character!K2>1,[1]Character!I2&\" points worth of \"&A44&\"s \"&B44,\"\"))&R44","v":""},{"$f":"S43&S44","v":{"$error":"#REF!"}}]
["Bear","(DOR15)",0,{"$f":"IF($B$24=1,1,0)","v":0},0,0,1,{"$f":"SUM(C45:G45)","v":1},4,"Druid (4)",null,null,null,null,null,{"$f":"SUM([1]Character!K3:'[1]Character'!K$34)","v":{"$error":"#REF!"}},null,{"$f":"IF([1]Character!K3>0,IF(P45>[1]Character!K3,\"; \",\"\"),\"\")","v":""},{"$f":"IF([1]Character!K3=1,[1]Character!G3,IF([1]Character!K3>1,[1]Character!I3&\" \"&A45&\"s \"&B45,\"\"))&R45","v":""},{"$f":"T44&S45","v":{"$error":"#REF!"}}]
["Fairy","(DOR29)",{"$f":"IF($B$23=1,1,0)","v":0},{"$f":"IF($B$24=1,1,0)","v":0},0,0,1,1,3,"Bard, Druid (3)",null,null,null,null,null,{"$f":"SUM([1]Character!K4:'[1]Character'!K$34)","v":{"$error":"#REF!"}},null,{"$f":"IF([1]Character!K4>0,IF(P46>[1]Character!K4,\"; \",\"\"),\"\")","v":""},{"$f":"IF([1]Character!K4=1,[1]Character!G4,IF([1]Character!K4>1,[1]Character!I4&\" \"&A46&\"s \"&B46,\"\"))&R46","v":""},{"$f":"T45&S46","v":{"$error":"#REF!"}}]
["Flesh Golem","(DOR35)",0,0,{"$f":"IF($B$25=1,1,0)","v":1},{"$f":"IF($B$26=1,1,0)","v":0},{"$f":"IF($B$2=6,1,0)","v":0},1,2,"6th Druid, Healer, Wizard (2)",null,null,null,null,null,{"$f":"SUM([1]Character!K5:'[1]Character'!K$34)","v":{"$error":"#REF!"}},null,{"$f":"IF([1]Character!K5>0,IF(P47>[1]Character!K5,\"; \",\"\"),\"\")","v":""},{"$f":"IF([1]Character!K5=1,[1]Character!G5,IF([1]Character!K5>1,[1]Character!I5&\" \"&A47&\"s \"&B47,\"\"))&R47","v":""},{"$error":"#REF!"}]
["Metal Golem","(DOR35)",0,0,{"$f":"IF($B$25=1,1,0)","v":1},{"$f":"IF($B$26=1,1,0)","v":0},0,1,4,"6th Druid, Healer, Wizard (4)",null,null,null,null,null,{"$f":"SUM([1]Character!K6:'[1]Character'!K$34)","v":{"$error":"#REF!"}},null,{"$f":"IF([1]Character!K6>0,IF(P48>[1]Character!K6,\"; \",\"\"),\"\")","v":""},{"$f":"IF([1]Character!K6=1,[1]Character!G6,IF([1]Character!K6>1,[1]Character!I6&\" \"&A48&\"s \"&B48,\"\"))&R48","v":""},{"$error":"#REF!"}]
["Mud Golem","(DOR36)",0,0,{"$f":"IF($B$25=1,1,0)","v":1},0,0,1,3,"6th Druid, Healer, Wizard (3)",null,null,null,null,null,{"$f":"SUM([1]Character!K7:'[1]Character'!K$34)","v":{"$error":"#REF!"}},null,{"$f":"IF([1]Character!K7>0,IF(P49>[1]Character!K7,\"; \",\"\"),\"\")","v":""},{"$f":"IF([1]Character!K7=1,[1]Character!G7,IF([1]Character!K7>1,[1]Character!I7&\" \"&A49&\"s \"&B49,\"\"))&R49","v":""},{"$error":"#REF!"}]
["Rag Golem","(DOR36)",{"$f":"IF($B$23=1,1,0)","v":0},0,0,0,0,0,3,"6th Bard, Wizard (3)",null,null,null,null,null,{"$f":"SUM([1]Character!K8:'[1]Character'!K$34)","v":{"$error":"#REF!"}},null,{"$f":"IF([1]Character!K8>0,IF(P50>[1]Character!K8,\"; \",\"\"),\"\")","v":""},{"$f":"IF([1]Character!K8=1,[1]Character!G8,IF([1]Character!K8>1,[1]Character!I8&\" \"&A50&\"s \"&B50,\"\"))&R50","v":""},{"$error":"#REF!"}]
["Rock Golem","(DOR37)",0,0,{"$f":"IF($B$25=1,1,0)","v":1},0,0,1,4,"6th Druid, Healer, Wizard (4)",null,null,null,null,null,{"$f":"SUM([1]Character!K9:'[1]Character'!K$34)","v":{"$error":"#REF!"}},null,{"$f":"IF([1]Character!K9>0,IF(P51>[1]Character!K9,\"; \",\"\"),\"\")","v":""},{"$f":"IF([1]Character!K9=1,[1]Character!G9,IF([1]Character!K9>1,[1]Character!I9&\" \"&A51&\"s \"&B51,\"\"))&R51","v":""},{"$error":"#REF!"}]
["Rope Golem","(DOR37)",0,0,0,0,0,0,2,"6th Druid, Wizard (2)",null,null,null,null,null,{"$f":"SUM([1]Character!K10:'[1]Character'!K$34)","v":{"$error":"#REF!"}},null,{"$f":"IF([1]Character!K10>0,IF(P52>[1]Character!K10,\"; \",\"\"),\"\")","v":""},{"$f":"IF([1]Character!K10=1,[1]Character!G10,IF([1]Character!K10>1,[1]Character!I10&\" \"&A52&\"s \"&B52,\"\"))&R52","v":""},{"$error":"#REF!"}]
["Scarecrow Golem","(DOR38)",0,0,0,0,{"$f":"IF($B$2=6,1,0)","v":0},0,3,"6th Druid, Wizard (3)",null,null,null,null,null,{"$f":"SUM([1]Character!K11:'[1]Character'!K$34)","v":{"$error":"#REF!"}},null,{"$f":"IF([1]Character!K11>0,IF(P53>[1]Character!K11,\"; \",\"\"),\"\")","v":""},{"$f":"IF([1]Character!K11=1,[1]Character!G11,IF([1]Character!K11>1,[1]Character!I11&\" \"&A53&\"s \"&B53,\"\"))&R53","v":""},{"$error":"#REF!"}]
["Great Bird","(DOR38)",0,0,0,0,1,1,2,"Druid (2)",null,null,null,null,null,{"$f":"SUM([1]Character!K12:'[1]Character'!K$34)","v":{"$error":"#REF!"}},null,{"$f":"IF([1]Character!K12>0,IF(P54>[1]Character!K12,\"; \",\"\"),\"\")","v":""},{"$f":"IF([1]Character!K12=1,[1]Character!G12,IF([1]Character!K12>1,[1]Character!I12&\" \"&A54&\"s \"&B54,\"\"))&R54","v":""},{"$error":"#REF!"}]
["Satyr","(DOR49)",{"$f":"IF($B$23=1,1,0)","v":0},0,0,0,{"$f":"IF($B$2=6,1,0)","v":0},0,3,"6th Bard, Druid (3)",null,null,null,null,null,{"$f":"SUM([1]Character!K13:'[1]Character'!K$34)","v":{"$error":"#REF!"}},null,{"$f":"IF([1]Character!K13>0,IF(P55>[1]Character!K13,\"; \",\"\"),\"\")","v":""},{"$f":"IF([1]Character!K13=1,[1]Character!G13,IF([1]Character!K13>1,[1]Character!I13&\" \"&A55&\"s \"&B55,\"\"))&R55","v":""},{"$error":"#REF!"}]
["Air Elemental","(DOR25)",0,0,0,0,{"$f":"IF($B$2=6,1,0)","v":0},0,3,"6th Druid, Wizard (3)",null,null,null,null,null,{"$f":"SUM([1]Character!K14:'[1]Character'!K$34)","v":{"$error":"#REF!"}},null,{"$f":"IF([1]Character!K14>0,IF(P56>[1]Character!K14,\"; \",\"\"),\"\")","v":""},{"$f":"IF([1]Character!K14=1,[1]Character!G14,IF([1]Character!K14>1,[1]Character!I14&\" \"&A56&\"s \"&B56,\"\"))&R56","v":""},{"$error":"#REF!"}]
["Earth Elemental","(DOR25)",0,0,0,0,0,0,3,"6th Druid, Wizard (3)",null,null,null,null,null,{"$f":"SUM([1]Character!K15:'[1]Character'!K$34)","v":{"$error":"#REF!"}},null,{"$f":"IF([1]Character!K15>0,IF(P57>[1]Character!K15,\"; \",\"\"),\"\")","v":""},{"$f":"IF([1]Character!K15=1,[1]Character!G15,IF([1]Character!K15>1,[1]Character!I15&\" \"&A57&\"s \"&B57,\"\"))&R57","v":""},{"$error":"#REF!"}]
["Fire Elemental","(DOR26)",0,0,0,0,0,0,3,"6th Druid, Wizard (3)",null,null,null,null,null,{"$f":"SUM([1]Character!K16:'[1]Character'!K$34)","v":{"$error":"#REF!"}},null,{"$f":"IF([1]Character!K16>0,IF(P58>[1]Character!K16,\"; \",\"\"),\"\")","v":""},{"$f":"IF([1]Character!K16=1,[1]Character!G16,IF([1]Character!K16>1,[1]Character!I16&\" \"&A58&\"s \"&B58,\"\"))&R58","v":""},{"$error":"#REF!"}]
["Water Elemental","(DOR26)",0,0,0,0,0,0,3,"6th Druid, Wizard (3)",null,null,null,null,null,{"$f":"SUM([1]Character!K17:'[1]Character'!K$34)","v":{"$error":"#REF!"}},null,{"$f":"IF([1]Character!K17>0,IF(P59>[1]Character!K17,\"; \",\"\"),\"\")","v":""},{"$f":"IF([1]Character!K17=1,[1]Character!G17,IF([1]Character!K17>1,[1]Character!I17&\" \"&A59&\"s \"&B59,\"\"))&R59","v":""},{"$error":"#REF!"}]
["Shadow Elemental","(BNTD16)",0,0,0,0,0,0,{"$f":"6-[1]Character!H19","v":6},"6th Wizard (6 minus 1/life sacrificed by summoner, min 3)",null,null,null,null,null,{"$f":"SUM([1]Character!K18:'[1]Character'!K$34)","v":{"$error":"#REF!"}},null,{"$f":"IF([1]Character!K18>0,IF(P60>[1]Character!K18,\"; \",\"\"),\"\")","v":""},{"$f":"IF([1]Character!K18=1,[1]Character!G18,IF([1]Character!K18>1,[1]Character!I18&\" \"&A60&\"s \"&B60,\"\"))&R60","v":""},{"$error":"#REF!"}]
["Undead Elemental","(BNTD16)",0,0,{"$f":"IF($B$25=1,1,0)","v":1},0,0,1,4,"6th Healer, Wizard (4)",null,null,null,null,null,{"$f":"SUM([1]Character!K20:'[1]Character'!K$34)","v":{"$error":"#REF!"}},"Add one to calc for Shadow Elem lfe sac entry",{"$f":"IF([1]Character!K20>0,IF(P61>[1]Character!K20,\"; \",\"\"),\"\")","v":""},{"$f":"IF([1]Character!K20=1,[1]Character!G20,IF([1]Character!K20>1,[1]Character!I20&\" \"&A61&\"s \"&B61,\"\"))&R61","v":""},{"$error":"#REF!"}]
["Alpha Wolf","(BNTD25)",{"$f":"IF($B$23=1,1,0)","v":0},0,0,0,{"$f":"IF($B$2>2,1,0)","v":0},0,3,"3rd Bard, Druid (3)",null,null,null,null,null,{"$f":"SUM([1]Character!K21:'[1]Character'!K$34)","v":{"$error":"#REF!"}},null,{"$f":"IF([1]Character!K21>0,IF(P62>[1]Character!K21,\"; \",\"\"),\"\")","v":""},{"$f":"IF([1]Character!K21=1,[1]Character!G21,IF([1]Character!K21>1,[1]Character!I21&\" \"&\"Alpha Wolves \"&B62,\"\"))&R62","v":""},{"$error":"#REF!"}]
["Wolf Pack Mate","(BNTD25)",{"$f":"IF($B$23=1,1,0)","v":0},0,0,0,1,1,2,"Bard, Druid (2)",null,null,null,null,null,{"$f":"SUM([1]Character!K22:'[1]Character'!K$34)","v":{"$error":"#REF!"}},null,{"$f":"IF([1]Character!K22>0,IF(P63>[1]Character!K22,\"; \",\"\"),\"\")","v":""},{"$f":"IF([1]Character!K22=1,[1]Character!G22,IF([1]Character!K22>1,[1]Character!I22&\" \"&A63&\"s \"&B63,\"\"))&R63","v":""},{"$error":"#REF!"}]
["Wolf Pack Mother","(BNTD26)",{"$f":"IF($B$23=1,1,0)","v":0},0,0,0,{"$f":"IF($B$2>1,1,0)","v":0},0,3,"2nd Bard, Druid (3)",null,null,null,null,null,{"$f":"SUM([1]Character!K23:'[1]Character'!K$34)","v":{"$error":"#REF!"}},null,{"$f":"IF([1]Character!K23>0,IF(P64>[1]Character!K23,\"; \",\"\"),\"\")","v":""},{"$f":"IF([1]Character!K23=1,[1]Character!G23,IF([1]Character!K23>1,[1]Character!I23&\" \"&A64&\"s \"&B64,\"\"))&R64","v":""},{"$error":"#REF!"}]
["Warrior of Wrath","(BNTD27)",0,0,{"$f":"IF($B$25=1,1,0)","v":1},0,{"$f":"IF($B$2=6,1,0)","v":0},1,2,"6th Healer, Wizard (2)",null,null,null,null,null,{"$f":"SUM([1]Character!K24:'[1]Character'!K$34)","v":{"$error":"#REF!"}},null,{"$f":"IF([1]Character!K24>0,IF(P65>[1]Character!K24,\"; \",\"\"),\"\")","v":""},{"$f":"IF([1]Character!K24=1,[1]Character!G24,IF([1]Character!K24>1,[1]Character!I24&\" \"&\"Warriors of Wrath \"&B65,\"\"))&R65","v":""},{"$error":"#REF!"}]
["Dolphin","(NN15)",{"$f":"IF($B$23=1,1,0)","v":0},0,{"$f":"IF($B$25=1,1,0)","v":1},0,1,2,2,"Bard, Druid, Healer (2)",null,null,null,null,null,{"$f":"SUM([1]Character!K25:'[1]Character'!K$34)","v":{"$error":"#REF!"}},null,{"$f":"IF([1]Character!K25>0,IF(P66>[1]Character!K25,\"; \",\"\"),\"\")","v":""},{"$f":"IF([1]Character!K25=1,[1]Character!G25,IF([1]Character!K25>1,[1]Character!I25&\" \"&A66&\"s \"&B66,\"\"))&R66","v":""},{"$error":"#REF!"}]
["Salt Elemental","(NN16)",0,0,0,0,{"$f":"IF($B$2=6,1,0)","v":0},0,3,"6th Druid, Wizard (3)",null,null,null,null,null,{"$f":"SUM([1]Character!K26:'[1]Character'!K$34)","v":{"$error":"#REF!"}},null,{"$f":"IF([1]Character!K26>0,IF(P67>[1]Character!K26,\"; \",\"\"),\"\")","v":""},{"$f":"IF([1]Character!K26=1,[1]Character!G26,IF([1]Character!K26>1,[1]Character!I26&\" \"&A67&\"s \"&B67,\"\"))&R67","v":""},{"$error":"#REF!"}]
["Storm Elemental","(NN17)",0,0,0,0,0,0,3,"6th Druid, Wizard (3)",null,null,null,null,null,{"$f":"SUM([1]Character!K27:'[1]Character'!K$34)","v":{"$error":"#REF!"}},null,{"$f":"IF([1]Character!K27>0,IF(P68>[1]Character!K27,\"; \",\"\"),\"\")","v":""},{"$f":"IF([1]Character!K27=1,[1]Character!G27,IF([1]Character!K27>1,[1]Character!I27&\" \"&A68&\"s \"&B68,\"\"))&R68","v":""},{"$error":"#REF!"}]
["Poseidon’s Child","(NN22)",0,0,{"$f":"IF($B$25=1,1,0)","v":1},0,0,1,3,"6th Healer (3)",null,null,null,null,null,{"$f":"SUM([1]Character!K28:'[1]Character'!K$34)","v":{"$error":"#REF!"}},null,{"$f":"IF([1]Character!K28>0,IF(P69>[1]Character!K28,\"; \",\"\"),\"\")","v":""},{"$f":"IF([1]Character!K28=1,[1]Character!G28,IF([1]Character!K28>1,[1]Character!I28&\" \"&A69&\"ren \"&B69,\"\"))&R69","v":""},{"$error":"#REF!"}]
["Void Elemental","(BoE26)",0,0,0,0,0,0,3,"6th Druid, Wizard (3)",null,null,null,null,null,{"$f":"SUM([1]Character!K29:'[1]Character'!K$34)","v":{"$error":"#REF!"}},null,{"$f":"IF([1]Character!K29>0,IF(P70>[1]Character!K29,\"; \",\"\"),\"\")","v":""},{"$f":"IF([1]Character!K29=1,[1]Character!G29,IF([1]Character!K29>1,[1]Character!I29&\" \"&A70&\"s \"&B70,\"\"))&R70","v":""},{"$error":"#REF!"}]
["Bamboo Golem","(BoE31)",0,0,0,0,0,0,3,"6th Druid, Wizard (3)",null,null,null,null,null,{"$f":"SUM([1]Character!K30:'[1]Character'!K$34)","v":{"$error":"#REF!"}},null,{"$f":"IF([1]Character!K30>0,IF(P71>[1]Character!K30,\"; \",\"\"),\"\")","v":""},{"$f":"IF([1]Character!K30=1,[1]Character!G30,IF([1]Character!K30>1,[1]Character!I30&\" \"&A71&\"s \"&B71,\"\"))&R71","v":""},{"$error":"#REF!"}]
["Fu Pair (2 Golems)","(BoE31)",0,0,{"$f":"IF($B$25=1,1,0)","v":1},0,0,1,6,"6th Healer, Wizard (6)",null,null,null,null,null,{"$f":"SUM([1]Character!K31:'[1]Character'!K$34)","v":{"$error":"#REF!"}},null,{"$f":"IF([1]Character!K31>0,IF(P72>[1]Character!K31,\"; \",\"\"),\"\")","v":""},{"$f":"IF([1]Character!K31=1,[1]Character!G31,IF([1]Character!K31>1,[1]Character!I31&\" \"&\"Fu Pairs (\"&[1]Character!I31*2&\" Golems) \"&B72,\"\"))&R72","v":""},{"$error":"#REF!"}]
["Terracotta Golem","(BoE32)",0,0,{"$f":"IF($B$25=1,1,0)","v":1},0,0,1,3,"6th Healer, Wizard (3)",null,null,null,null,null,{"$f":"SUM([1]Character!K32:'[1]Character'!K$34)","v":{"$error":"#REF!"}},null,{"$f":"IF([1]Character!K32>0,IF(P73>[1]Character!K32,\"; \",\"\"),\"\")","v":""},{"$f":"IF([1]Character!K32=1,[1]Character!G32,IF([1]Character!K32>1,[1]Character!I32&\" \"&A73&\"s \"&B73,\"\"))&R73","v":""},{"$error":"#REF!"}]
["Nurikabe","(BoE43)",0,0,0,0,1,1,2,"Wizard (2)",null,null,null,null,null,{"$f":"SUM([1]Character!K33:'[1]Character'!K$34)","v":0},null,{"$f":"IF([1]Character!K33>0,IF(P74>[1]Character!K33,\"; \",\"\"),\"\")","v":""},{"$f":"IF([1]Character!K33=1,[1]Character!G33,IF([1]Character!K33>1,[1]Character!I33&\" \"&A74&\" \"&B74,\"\"))&R74","v":""},{"$error":"#REF!"}]
["Shikigami","(BoE50)",0,0,0,0,2,2,1,"Any (1-3)",null,null,null,null,null,"-",null,null,{"$f":"IF([1]Character!K33=1,\"1 point \"&[1]Character!G33,IF([1]Character!K33>1,[1]Character!I33&\" points worth of \"&A75&\" \"&B75,\"\"))","v":""},{"$error":"#REF!"}]

{"sheet":"Wizard","index":6,"n_rows":0,"n_cols":0,"rows_kept":0,"cut":false,"hidden":true,"merged":[]}